Xcodebuild Clang Error Linker Command Failed With Exit Code 1

Xcode Build error: library not found for -lDoubleConversion · Issue

Xcode Build error: library not found for -lDoubleConversion · Issue

Creating and Distributing an iOS Binary Framework | Instabug Blog

Creating and Distributing an iOS Binary Framework | Instabug Blog

Error with cordova-plugin-firebase - Ionic Native - Ionic Forum

Error with cordova-plugin-firebase - Ionic Native - Ionic Forum

clang: error: linker command failed with exit code 1 when archiving

clang: error: linker command failed with exit code 1 when archiving

Setting up GitLab CI for iOS projects | GitLab

Setting up GitLab CI for iOS projects | GitLab

Xcode Test Target - Linker errors, missing headers - MacOSX and iOS

Xcode Test Target - Linker errors, missing headers - MacOSX and iOS

linker command failed with exit code 1 (use -v to see invocation

linker command failed with exit code 1 (use -v to see invocation

Ionic Package: iOS Release Build Error in Package/Ionic Services

Ionic Package: iOS Release Build Error in Package/Ionic Services

Tutorial] Make a  IPA from a Xcode project : jailbreak

Tutorial] Make a IPA from a Xcode project : jailbreak

Ionic 2 Facebook Login: Step-by-step guide to get it working with

Ionic 2 Facebook Login: Step-by-step guide to get it working with

How to use Hybrid Application Toolkit (HAT) and test the apps – Run

How to use Hybrid Application Toolkit (HAT) and test the apps – Run

Duplicate Symbols For Architecture Arm64 Xcode 9 - Works Best Architects

Duplicate Symbols For Architecture Arm64 Xcode 9 - Works Best Architects

Overview of application publishing - Siberian CMS

Overview of application publishing - Siberian CMS

All kinds of errors getting SFML 2 to run in Xcode, would appreciate

All kinds of errors getting SFML 2 to run in Xcode, would appreciate

基本解决]使用iOS模拟器iPhone 6结果编译出错:file was built for i386

基本解决]使用iOS模拟器iPhone 6结果编译出错:file was built for i386

Help with the

Help with the "Create New Binding" option in 1 3 x plugin - Support

Linker command failed - Xcode Build failed · Issue #1430 · react

Linker command failed - Xcode Build failed · Issue #1430 · react

Xcode7 出现的clang error:linker command failed wit    - 简书

Xcode7 出现的clang error:linker command failed wit - 简书

arm64 linker error | Vuforia Developer Portal

arm64 linker error | Vuforia Developer Portal

Unity & UBT & iPhone 6Plus - Structure SDK (for iOS) - Structure

Unity & UBT & iPhone 6Plus - Structure SDK (for iOS) - Structure

Setting up GitLab CI for iOS projects | GitLab

Setting up GitLab CI for iOS projects | GitLab

Unity - Manual: Troubleshooting on iOS devices

Unity - Manual: Troubleshooting on iOS devices

Cocoapods remove duplicate symbols for architecture i386 error

Cocoapods remove duplicate symbols for architecture i386 error

Compile or cmake problems - Page 116 - Help and Support - TrinityCore

Compile or cmake problems - Page 116 - Help and Support - TrinityCore

Improving Your Build Time in Xcode 10 · Patrick Balestra

Improving Your Build Time in Xcode 10 · Patrick Balestra

Article: iOS 12 Most Frequent Build Issues -(Part 2) libstdc++ is

Article: iOS 12 Most Frequent Build Issues -(Part 2) libstdc++ is

Duplicate Symbols For Architecture Arm64 Xcode 9 - Works Best Architects

Duplicate Symbols For Architecture Arm64 Xcode 9 - Works Best Architects

Stay local, let your IDE do remote work for you! | CLion Blog

Stay local, let your IDE do remote work for you! | CLion Blog

Xcode build failing for protected mode using updated iOS plugins

Xcode build failing for protected mode using updated iOS plugins

arm64 linker error | Vuforia Developer Portal

arm64 linker error | Vuforia Developer Portal

Improving Your Build Time in Xcode 10 · Patrick Balestra

Improving Your Build Time in Xcode 10 · Patrick Balestra

PureBasic Forum • View topic - PB x86 compiler doesn't work anymore

PureBasic Forum • View topic - PB x86 compiler doesn't work anymore

CocoaPods install | How to use CocoaPods | Podfile create | Pod

CocoaPods install | How to use CocoaPods | Podfile create | Pod

iOS & Android Native Build Errors with Cordova Plugins

iOS & Android Native Build Errors with Cordova Plugins

Creating a Static Library in iOS Tutorial | raywenderlich com

Creating a Static Library in iOS Tutorial | raywenderlich com

ios - How to code sign a Carthage framework for App Store submission

ios - How to code sign a Carthage framework for App Store submission

Setting up GitLab CI for iOS projects | GitLab

Setting up GitLab CI for iOS projects | GitLab

Native binding to Xamarin with libstdc++ as C++ Standard Library

Native binding to Xamarin with libstdc++ as C++ Standard Library

How to Deploy your App on an iPhone (Updated for 2018)

How to Deploy your App on an iPhone (Updated for 2018)

Getting error

Getting error "linker command failed with exit code 1 (use -v to see

Invoking the Power of the Command Line | SpringerLink

Invoking the Power of the Command Line | SpringerLink

IPA generation failing in Xcode 10 with iOS Plugin 8 3

IPA generation failing in Xcode 10 with iOS Plugin 8 3

Let's Build Chuck Norris! - Part 8: Using C++ in an iOS application

Let's Build Chuck Norris! - Part 8: Using C++ in an iOS application

Xcode] ”linker command failed with exit code 1” エラー対処方法

Xcode] ”linker command failed with exit code 1” エラー対処方法

SOLVED] Error when building Meteor App for iOS using Cordova - help

SOLVED] Error when building Meteor App for iOS using Cordova - help

iMac Pro X99 - live the future now with macOS 10 14 Mojave

iMac Pro X99 - live the future now with macOS 10 14 Mojave

未解决]Carthage去安装Charts库时编译ChartsRealm-iOS出错:Ld armv7

未解决]Carthage去安装Charts库时编译ChartsRealm-iOS出错:Ld armv7

Xcode build failing for protected mode using updated iOS plugins

Xcode build failing for protected mode using updated iOS plugins

Linking Xamarin iOS Apps - Xamarin | Microsoft Docs

Linking Xamarin iOS Apps - Xamarin | Microsoft Docs

Apple Mach-O Linker Error - When Building iOS Samples | Vuforia

Apple Mach-O Linker Error - When Building iOS Samples | Vuforia

Xcode】【iOS】ライブラリ導入時のApple Mach-O Linker Error  library

Xcode】【iOS】ライブラリ導入時のApple Mach-O Linker Error library

CLion answers frequently asked questions | CLion Blog

CLion answers frequently asked questions | CLion Blog

Linker command failed with exit code 1 (use -v to see invocation

Linker command failed with exit code 1 (use -v to see invocation

MOE Authentication or Native - Support - Multi-OS Engine

MOE Authentication or Native - Support - Multi-OS Engine

iOS Build Always fails · Issue #174 · microsoft/appcenter · GitHub

iOS Build Always fails · Issue #174 · microsoft/appcenter · GitHub

iOS and Android setup on MacOS - Build Failed when trying to set up

iOS and Android setup on MacOS - Build Failed when trying to set up

iOS and Android setup on MacOS - Build Failed when trying to set up

iOS and Android setup on MacOS - Build Failed when trying to set up

Firebase for Unity (iOS) linker errors (ARCHIVE FAILED) - Google Groups

Firebase for Unity (iOS) linker errors (ARCHIVE FAILED) - Google Groups

SOLVED] Fix Apple Mach-O Linker Error in Simple Steps - MacMetric

SOLVED] Fix Apple Mach-O Linker Error in Simple Steps - MacMetric

Apple Mach-O Linker Error Xcode, Unity3D Warnings: Solved

Apple Mach-O Linker Error Xcode, Unity3D Warnings: Solved

Release Notes for Xcode 9 Beta 2 | Swift (Programming Language) | Xcode

Release Notes for Xcode 9 Beta 2 | Swift (Programming Language) | Xcode

Developers - iOS - Xcode: linker command failed with exit code 1

Developers - iOS - Xcode: linker command failed with exit code 1

Can't spawn custom sprites - C++ - Cocos Forums

Can't spawn custom sprites - C++ - Cocos Forums

Manual Swift: Understanding the Swift/Objective-C Build Pipeline

Manual Swift: Understanding the Swift/Objective-C Build Pipeline

Simple Firefox for Android build - Mozilla | MDN

Simple Firefox for Android build - Mozilla | MDN

Clang + OpenMP Setup in Xcode – Anton Menshov

Clang + OpenMP Setup in Xcode – Anton Menshov

Creating and Distributing an iOS Binary Framework | Instabug Blog

Creating and Distributing an iOS Binary Framework | Instabug Blog

Static Libraries, Frameworks, and Bitcode - Heitor T  Sergent - Medium

Static Libraries, Frameworks, and Bitcode - Heitor T Sergent - Medium

Exporting for iOS — Godot Engine latest documentation

Exporting for iOS — Godot Engine latest documentation

Getting error

Getting error "linker command failed with exit code 1 (use -v to see

Сборка архива Xcode завершилась неудачно с реагированием на

Сборка архива Xcode завершилась неудачно с реагированием на

Cross compiling (iOS build on Win) gives

Cross compiling (iOS build on Win) gives "Undefined symbols for

알레폰드의 IT 이모저모 :: ios error itms-9000 no  app bundles found

알레폰드의 IT 이모저모 :: ios error itms-9000 no app bundles found

Xcode version 4 6 2 (4H1003) compiler error - Stack Overflow

Xcode version 4 6 2 (4H1003) compiler error - Stack Overflow

Xcode Creating Universal Frameworks as Dependents of a Universal

Xcode Creating Universal Frameworks as Dependents of a Universal

linker command failed with exit code 1 (use -v to see invocation

linker command failed with exit code 1 (use -v to see invocation

Improving Your Build Time in Xcode 10 · Patrick Balestra

Improving Your Build Time in Xcode 10 · Patrick Balestra

Clang + OpenMP Setup in Xcode – Anton Menshov

Clang + OpenMP Setup in Xcode – Anton Menshov

Unity】Xcodeでビルドするときに「linker command failed with exit code

Unity】Xcodeでビルドするときに「linker command failed with exit code

PVS-Studio Documentation (single file)

PVS-Studio Documentation (single file)

pods issue, linker command failed with exit code 1 - Stack Overflow

pods issue, linker command failed with exit code 1 - Stack Overflow